Thread Rating:
  • 0 Vote(s) - 0 Average
  • 1
  • 2
  • 3
  • 4
  • 5
linux-compile-error
#1
/usr/include/libintl.h: At global scope:
/usr/include/libintl.h:40: error: expected unqualified-id before ‘const’
/usr/include/libintl.h:40: error: expected `)' before ‘const’
/usr/include/libintl.h:40: error: expected initializer before ‘const’
/usr/include/libintl.h:45: error: expected unqualified-id before ‘const’
/usr/include/libintl.h:45: error: expected `)' before ‘const’
/usr/include/libintl.h:45: error: expected initializer before ‘const’
/usr/include/libintl.h:52: error: expected unqualified-id before ‘const’
/usr/include/libintl.h:52: error: expected `)' before ‘const’
/usr/include/libintl.h:52: error: expected initializer before ‘const’
/usr/include/libintl.h:83: error: expected unqualified-id before ‘const’
/usr/include/libintl.h:83: error: expected `)' before ‘const’
/usr/include/libintl.h:83: error: expected initializer before ‘const’
/usr/include/libintl.h:87: error: expected unqualified-id before ‘const’
/usr/include/libintl.h:87: error: expected `)' before ‘const’
/usr/include/libintl.h:87: error: expected initializer before ‘const’
Linux/Linux.cpp: In function ‘void SPU2about()’:
Linux/Linux.cpp:158: warning: deprecated conversion from string constant to ‘char*’
make[1]: *** [libZeroSPU2_a-Linux.o] Error 1
make[1]: Leaving directory `/home/uranus/pcsx2-playground-read-only/plugins/spu2/zerospu2'
make: *** [install-recursive] Error 1
Error with building plugins
##################################
above is the information when I compiling pcsx2_pg. my system is Ubuntu 8.04.
by the way ,which file should i copy form pcsx2_read_only to pcsx2-playground-read-only?
Reply

Sponsored links

#2
how many buid.sh-files should I copy ?just two ----- "pcsx2-read-only/plugins/build.sh" and "pcsx2-read-only/pcsx2/build.sh" or all that in the subdirs? thank you very much
Reply
#3
In file included from ./../Common.h:67,
from ./../Sif.h:22,
from ./../PsxCommon.h:51,
from iR3000A.cpp:32:
./../SaveState.h:205:7: warning: no newline at end of file
In file included from iR3000A.h:23,
from iR3000A.cpp:37:
BaseblockEx.h:69:7: warning: no newline at end of file
iR3000A.cpp: In function ‘void recResetIOP()’:
iR3000A.cpp:605: error: ‘memset_8’ was not declared in this scope
iR3000A.cpp:605: warning: ISO C++ forbids comparison between pointer and integer
make[2]: *** [iR3000A.o] Error 1
make[2]: Leaving directory `/home/uranus/pcsx2-playground-read-only/pcsx2/x86'
make[1]: *** [install-recursive] Error 1
make[1]: Leaving directory `/home/uranus/pcsx2-playground-read-only/pcsx2/x86'
make: *** [install-recursive] Error 1
Error with building pcsx2
#################
this is my new error after my correctly copying files . is there something worng with my ubuntu version?
Reply
#4
You could not compile recent builds without patch I provided for memset_8. But even if you apply it, it's noncence: the result is usable only in interpreter mode. You should use only revision before 458.
Reply
#5
OK ,thanks for answering
Reply
#6
another question.
Is libZeroGSoglr.so.0.96.2 the newest linux-graphics-plugin by now? if not ,can you give me the newest one ?
MY email: linan7788626@hotmail.com
thank you very much.
Reply




Users browsing this thread: 1 Guest(s)