Invalid: [Compile Error] Cmake, pixbuf lib
#1
Fedora 33, pcsx2 1.7.0 build #870, this popped up at the end:

Code:
[100%] Linking CXX executable PCSX2
/usr/bin/ld: CMakeFiles/PCSX2.dir/USB/usb-pad/evdev/shared-gtk.cpp.o: undefined reference to symbol 'gdk_pixbuf_get_pixels'
/usr/bin/ld: /lib/libgdk_pixbuf-2.0.so.0: error adding symbols: DSO missing from command line
collect2: error: ld returned 1 exit status
make[2]: *** [pcsx2/CMakeFiles/PCSX2.dir/build.make:5478: pcsx2/PCSX2] Error 1
make[1]: *** [CMakeFiles/Makefile2:446: pcsx2/CMakeFiles/PCSX2.dir/all] Error 2
make: *** [Makefile:149: all] Error 2
D: waitpid(2803) rc 2803 status 200
D: /bin/sh failed: 200
error: Bad exit status from /var/tmp/rpm-tmp.IuJsO4 (%build)


Looks like I forgot to install gdk-pixbuf2-devel.i686.  Is this missing in the initial Cmake checkforstuff thingy?

Sponsored links

#2
Thank you for your report.
This bug report has now been marked as Invalid since it either was not reproducible, not a valid bug or otherwise unacceptable for fixing.

This thread will now be closed and moved in the Invalid/rejected/duplicate bug reports subforum.
CPU: I7-4770 3.9GHZ
Motherboard: Asrock B85M - DGS
RAM: Hyper X Savage 2x8GB 1.6GHZ CL9
GPU: GTX1070 8GB GDDR5
OS: Windows 10 Pro 64bit




Users browsing this thread: 1 Guest(s)