Thread Rating:
  • 5 Vote(s) - 5 Average
  • 1
  • 2
  • 3
  • 4
  • 5
PCSX2 for Arch Linux
???
Intel issues are on Windows driver. I don't think you use them. However I hope they didn't break Mesa again.

What popup windows ?
Reply

Sponsored links

Hi there,

I'm gettin bellow error with PCSX2-git from AUR, is there any way to fix that error

Code:
PCSX2        
12:23:28: Warning: Mismatch between the program and library build versions detected.
The library used 3.0 (wchar_t,compiler with C++ ABI 1011,wx containers,compatible with 2.8),
and your program used 3.0 (wchar_t,compiler with C++ ABI 1012,wx containers,compatible with 2.8).

(PCSX2:27826): Gtk-WARNING **: 12:23:28.666: Unable to locate theme engine in module_path: "adwaita",

(PCSX2:27826): Gtk-WARNING **: 12:23:28.670: Unable to locate theme engine in module_path: "murrine",

(PCSX2:27826): Gtk-WARNING **: 12:23:28.671: Unable to locate theme engine in module_path: "adwaita",
Interface is initializing.  Entering Pcsx2App::OnInit!
Applying operating system default language...
Command line parsing...
Command line parsed!
[1]    27826 segmentation fault (core dumped)  PCSX2
also
Code:
PCSX2-linux.sh
zsh: permission denied: PCSX2-linux.sh
Reply
The segfault is a GCC8 bug. A workaround to the bug will be applied soon.
Reply
Thanks for the prompt reply.

Waiting for the update then.
Reply
Workaround has been applied.
Reply
(05-12-2018, 01:07 PM)turtleli Wrote: Workaround has been applied.


Thank you for heads up.

Working as expected. thanks alot.
Reply
Code:
-> Cloning pcsx2 git repo...
Cloning into bare repository '/data/Games/Consoles & Emulators/pcsx2-git/pcsx2'...
remote: Enumerating objects: 7, done.
remote: Counting objects: 100% (7/7), done.
remote: Compressing objects: 100% (7/7), done.
remote: Total 144846 (delta 2), reused 0 (delta 0), pack-reused 144839
Receiving objects: 100% (144846/144846), 105.96 MiB | 881.00 KiB/s, done.
Resolving deltas: 100% (111585/111585), done.
==> Validating source files with sha256sums...
    pcsx2 ... Skipped
==> Extracting sources...
  -> Creating working copy of pcsx2 git repo...
Cloning into 'pcsx2'...
done.
==> Starting prepare()...
==> Starting pkgver()...
==> Updated version: pcsx2-git 1.5.0.r3199.2f8932e37-1
==> Starting build()...
-- The C compiler identification is GNU 9.1.0
-- The CXX compiler identification is GNU 9.1.0
-- Check for working C compiler: /usr/bin/cc
-- Check for working C compiler: /usr/bin/cc -- works
-- Detecting C compiler ABI info
-- Detecting C compiler ABI info - done
-- Detecting C compile features
-- Detecting C compile features - done
-- Check for working CXX compiler: /usr/bin/c++
-- Check for working CXX compiler: /usr/bin/c++ -- works
-- Detecting CXX compiler ABI info
-- Detecting CXX compiler ABI info - done
-- Detecting CXX compile features
-- Detecting CXX compile features - done
-- Building with GNU GCC
-- Enable the building of po files by default in Release build !!!
-- Cross compilation is enabled.
-- Compiling a i386 build on a x86_64 host.
-- Found ALSA: /usr/lib32/libasound.so (found version "1.1.9")
-- Found PCAP: /usr/lib32/libpcap.so 
-- Performing Test PCAP_LINKS_SOLO
-- Performing Test PCAP_LINKS_SOLO - Success
-- Looking for pcap_get_pfring_id
-- Looking for pcap_get_pfring_id - not found
-- Found LibXml2: /usr/lib32/libxml2.so (found version "2.9.9")
-- Found Freetype: /usr/lib32/libfreetype.so (found version "2.10.1")
-- Found Gettext: /usr/bin/msgmerge (found version "0.19.8.1")
-- Found Git: /usr/bin/git (found version "2.22.0")
-- Looking for lzma_auto_decoder in /usr/lib32/liblzma.so
-- Looking for lzma_auto_decoder in /usr/lib32/liblzma.so - found
-- Looking for lzma_easy_encoder in /usr/lib32/liblzma.so
-- Looking for lzma_easy_encoder in /usr/lib32/liblzma.so - found
-- Looking for lzma_lzma_preset in /usr/lib32/liblzma.so
-- Looking for lzma_lzma_preset in /usr/lib32/liblzma.so - found
-- Found LibLZMA: /usr/lib32/liblzma.so (found version "5.2.4")
-- Found OpenGL: /usr/lib32/libOpenGL.so 
-- Found ZLIB: /usr/lib32/libz.so (found version "1.2.11")
-- Found PNG: /usr/lib32/libpng.so (found version "1.6.37")
-- Could NOT find Vtune (missing: VTUNE_LIBRARIES VTUNE_INCLUDE_DIRS)
-- Found wxWidgets: -L/usr/lib32;-pthread;;;-lwx_baseu-3.0;-lwx_gtk2u_core-3.0;-lwx_gtk2u_adv-3.0 (found version "3.0.4")
-- Found Libc: /usr/lib32/librt.so;/usr/lib32/libdl.so;/usr/lib32/libm.so 
-- Found Cg: /usr/lib32/libCg.so;/usr/lib32/libCgGL.so 
-- Found GLEW: /usr/lib32/libGLEW.so 
-- Found JPEG: /usr/lib32/libjpeg.so (found version "80")
-- Found PkgConfig: /usr/bin/pkg-config (found version "1.6.1")
-- AIO found
-- LIBUDEV found
-- PORTAUDIO found
-- SOUNDTOUCH found
-- SDL2 found
-- Found X11: /usr/include 
-- Looking for XOpenDisplay in /usr/lib32/libX11.so;/usr/lib32/libXext.so
-- Looking for XOpenDisplay in /usr/lib32/libX11.so;/usr/lib32/libXext.so - found
-- Looking for gethostbyname
-- Looking for gethostbyname - found
-- Looking for connect
-- Looking for connect - found
-- Looking for remove
-- Looking for remove - found
-- Looking for shmat
-- Looking for shmat - found
-- Looking for IceConnectionNumber in ICE
-- Looking for IceConnectionNumber in ICE - found
-- Found GTK2_GTK: /usr/lib32/libgtk-x11-2.0.so 
CMake Warning at cmake/SearchForStuff.cmake:218 (message):
 

      It looks like you are compiling with 9.0.x or 9.1.x. Using these versions is not recommended,
      as there is a bug known to cause the compiler to segfault while compiling. See patch
      https://gitweb.gentoo.org/proj/gcc-patches.git/commit/?id=275ab714637a64672c6630cfd744af2c70957d5a
      Even with that patch, compiling with LTO may still segfault. Use at your own risk!
      This text being in a compile log in an open issue may cause it to be closed.
Call Stack (most recent call first):
  CMakeLists.txt:27 (include)


-- Don't build zerospu2. It is superceded by spu2x
-- Configuring done
-- Generating done
-- Build files have been written to: /data/Games/Consoles & Emulators/pcsx2-git/src/pcsx2/build
Scanning dependencies of target translations_pcsx2_Main
[  0%] Generating ../ar_SA__pcsx2_Main.gmo
/bin/sh:  Emulators/pcsx2-git/src/pcsx2/locales/ar_SA/pcsx2_Main.po: No such file or directory
/bin/sh:  Emulators/pcsx2-git/src/pcsx2/locales/templates/pcsx2_Main.pot: No such file or directory
/usr/bin/msgmerge: exactly 2 input files required
Try '/usr/bin/msgmerge --help' for more information.
make[2]: *** [locales/CMakeFiles/translations_pcsx2_Main.dir/build.make:86: ar_SA__pcsx2_Main.gmo] Error 127
make[1]: *** [CMakeFiles/Makefile2:93: locales/CMakeFiles/translations_pcsx2_Main.dir/all] Error 2
make: *** [Makefile:130: all] Error 2
==> ERROR: A failure occurred in build().
    Aborting...

This is what I get when I try to go through the arch process to build (I'm trying to get the new onepad but...well, I'm failing.
Reply
(07-14-2019, 09:51 PM)UnrulyMop Wrote:
Code:
-> Cloning pcsx2 git repo...
Cloning into bare repository '/data/Games/Consoles & Emulators/pcsx2-git/pcsx2'...
remote: Enumerating objects: 7, done.
remote: Counting objects: 100% (7/7), done.
remote: Compressing objects: 100% (7/7), done.
remote: Total 144846 (delta 2), reused 0 (delta 0), pack-reused 144839
Receiving objects: 100% (144846/144846), 105.96 MiB | 881.00 KiB/s, done.
Resolving deltas: 100% (111585/111585), done.
==> Validating source files with sha256sums...
    pcsx2 ... Skipped
==> Extracting sources...
  -> Creating working copy of pcsx2 git repo...
Cloning into 'pcsx2'...
done.
==> Starting prepare()...
==> Starting pkgver()...
==> Updated version: pcsx2-git 1.5.0.r3199.2f8932e37-1
==> Starting build()...
-- The C compiler identification is GNU 9.1.0
-- The CXX compiler identification is GNU 9.1.0
-- Check for working C compiler: /usr/bin/cc
-- Check for working C compiler: /usr/bin/cc -- works
-- Detecting C compiler ABI info
-- Detecting C compiler ABI info - done
-- Detecting C compile features
-- Detecting C compile features - done
-- Check for working CXX compiler: /usr/bin/c++
-- Check for working CXX compiler: /usr/bin/c++ -- works
-- Detecting CXX compiler ABI info
-- Detecting CXX compiler ABI info - done
-- Detecting CXX compile features
-- Detecting CXX compile features - done
-- Building with GNU GCC
-- Enable the building of po files by default in Release build !!!
-- Cross compilation is enabled.
-- Compiling a i386 build on a x86_64 host.
-- Found ALSA: /usr/lib32/libasound.so (found version "1.1.9")
-- Found PCAP: /usr/lib32/libpcap.so 
-- Performing Test PCAP_LINKS_SOLO
-- Performing Test PCAP_LINKS_SOLO - Success
-- Looking for pcap_get_pfring_id
-- Looking for pcap_get_pfring_id - not found
-- Found LibXml2: /usr/lib32/libxml2.so (found version "2.9.9")
-- Found Freetype: /usr/lib32/libfreetype.so (found version "2.10.1")
-- Found Gettext: /usr/bin/msgmerge (found version "0.19.8.1")
-- Found Git: /usr/bin/git (found version "2.22.0")
-- Looking for lzma_auto_decoder in /usr/lib32/liblzma.so
-- Looking for lzma_auto_decoder in /usr/lib32/liblzma.so - found
-- Looking for lzma_easy_encoder in /usr/lib32/liblzma.so
-- Looking for lzma_easy_encoder in /usr/lib32/liblzma.so - found
-- Looking for lzma_lzma_preset in /usr/lib32/liblzma.so
-- Looking for lzma_lzma_preset in /usr/lib32/liblzma.so - found
-- Found LibLZMA: /usr/lib32/liblzma.so (found version "5.2.4")
-- Found OpenGL: /usr/lib32/libOpenGL.so 
-- Found ZLIB: /usr/lib32/libz.so (found version "1.2.11")
-- Found PNG: /usr/lib32/libpng.so (found version "1.6.37")
-- Could NOT find Vtune (missing: VTUNE_LIBRARIES VTUNE_INCLUDE_DIRS)
-- Found wxWidgets: -L/usr/lib32;-pthread;;;-lwx_baseu-3.0;-lwx_gtk2u_core-3.0;-lwx_gtk2u_adv-3.0 (found version "3.0.4")
-- Found Libc: /usr/lib32/librt.so;/usr/lib32/libdl.so;/usr/lib32/libm.so 
-- Found Cg: /usr/lib32/libCg.so;/usr/lib32/libCgGL.so 
-- Found GLEW: /usr/lib32/libGLEW.so 
-- Found JPEG: /usr/lib32/libjpeg.so (found version "80")
-- Found PkgConfig: /usr/bin/pkg-config (found version "1.6.1")
-- AIO found
-- LIBUDEV found
-- PORTAUDIO found
-- SOUNDTOUCH found
-- SDL2 found
-- Found X11: /usr/include 
-- Looking for XOpenDisplay in /usr/lib32/libX11.so;/usr/lib32/libXext.so
-- Looking for XOpenDisplay in /usr/lib32/libX11.so;/usr/lib32/libXext.so - found
-- Looking for gethostbyname
-- Looking for gethostbyname - found
-- Looking for connect
-- Looking for connect - found
-- Looking for remove
-- Looking for remove - found
-- Looking for shmat
-- Looking for shmat - found
-- Looking for IceConnectionNumber in ICE
-- Looking for IceConnectionNumber in ICE - found
-- Found GTK2_GTK: /usr/lib32/libgtk-x11-2.0.so 
CMake Warning at cmake/SearchForStuff.cmake:218 (message):
 

      It looks like you are compiling with 9.0.x or 9.1.x. Using these versions is not recommended,
      as there is a bug known to cause the compiler to segfault while compiling. See patch
      https://gitweb.gentoo.org/proj/gcc-patches.git/commit/?id=275ab714637a64672c6630cfd744af2c70957d5a
      Even with that patch, compiling with LTO may still segfault. Use at your own risk!
      This text being in a compile log in an open issue may cause it to be closed.
Call Stack (most recent call first):
  CMakeLists.txt:27 (include)


-- Don't build zerospu2. It is superceded by spu2x
-- Configuring done
-- Generating done
-- Build files have been written to: /data/Games/Consoles & Emulators/pcsx2-git/src/pcsx2/build
Scanning dependencies of target translations_pcsx2_Main
[  0%] Generating ../ar_SA__pcsx2_Main.gmo
/bin/sh:  Emulators/pcsx2-git/src/pcsx2/locales/ar_SA/pcsx2_Main.po: No such file or directory
/bin/sh:  Emulators/pcsx2-git/src/pcsx2/locales/templates/pcsx2_Main.pot: No such file or directory
/usr/bin/msgmerge: exactly 2 input files required
Try '/usr/bin/msgmerge --help' for more information.
make[2]: *** [locales/CMakeFiles/translations_pcsx2_Main.dir/build.make:86: ar_SA__pcsx2_Main.gmo] Error 127
make[1]: *** [CMakeFiles/Makefile2:93: locales/CMakeFiles/translations_pcsx2_Main.dir/all] Error 2
make: *** [Makefile:130: all] Error 2
==> ERROR: A failure occurred in build().
    Aborting...

This is what I get when I try to go through the arch process to build (I'm trying to get the new onepad but...well, I'm failing.

Strange. I am unable to reproduce that error. Consider cleaning the source directory ($srcdir) before building. You can use -C flag with makepkg or -c flag with makechrootpkg (last one is if you are building in a clean chroot)
Reply
Personally, I get another error:

Code:
==> Starting build()...
-- The C compiler identification is GNU 9.1.0
-- The CXX compiler identification is GNU 9.1.0
-- Check for working C compiler: /usr/bin/cc
-- Check for working C compiler: /usr/bin/cc -- works
-- Detecting C compiler ABI info
-- Detecting C compiler ABI info - done
-- Detecting C compile features
-- Detecting C compile features - done
-- Check for working CXX compiler: /usr/bin/c++
-- Check for working CXX compiler: /usr/bin/c++ -- works
-- Detecting CXX compiler ABI info
-- Detecting CXX compiler ABI info - done
-- Detecting CXX compile features
-- Detecting CXX compile features - done
-- Building with GNU GCC
-- Enable the building of po files by default in Release build !!!
-- Cross compilation is enabled.
-- Compiling a i386 build on a x86_64 host.
-- Found ALSA: /usr/lib32/libasound.so (found version "1.1.9")
-- Found PCAP: /usr/lib32/libpcap.so 
-- Performing Test PCAP_LINKS_SOLO
-- Performing Test PCAP_LINKS_SOLO - Success
-- Looking for pcap_get_pfring_id
-- Looking for pcap_get_pfring_id - not found
-- Found LibXml2: /usr/lib32/libxml2.so (found version "2.9.9")
-- Found Freetype: /usr/lib32/libfreetype.so (found version "2.10.0")
-- Found Gettext: /usr/bin/msgmerge (found version "0.19.8.1")
-- Found Git: /usr/bin/git (found version "2.22.0")
-- Looking for lzma_auto_decoder in /usr/lib32/liblzma.so
-- Looking for lzma_auto_decoder in /usr/lib32/liblzma.so - found
-- Looking for lzma_easy_encoder in /usr/lib32/liblzma.so
-- Looking for lzma_easy_encoder in /usr/lib32/liblzma.so - found
-- Looking for lzma_lzma_preset in /usr/lib32/liblzma.so
-- Looking for lzma_lzma_preset in /usr/lib32/liblzma.so - found
-- Found LibLZMA: /usr/lib32/liblzma.so (found version "5.2.4")
-- Found OpenGL: /usr/lib32/libOpenGL.so   
-- Found ZLIB: /usr/lib32/libz.so (found version "1.2.11")
-- Found PNG: /usr/lib32/libpng.so (found version "1.6.37")
-- Could NOT find Vtune (missing: VTUNE_LIBRARIES VTUNE_INCLUDE_DIRS)
-- Found wxWidgets: -L/usr/lib32;-pthread;;;-lwx_baseu-3.0;-lwx_gtk2u_core-3.0;-lwx_gtk2u_adv-3.0 (found version "3.0.4")
-- Found Libc: /usr/lib32/librt.so;/usr/lib32/libdl.so;/usr/lib32/libm.so 
-- Found Cg: /usr/lib32/libCg.so;/usr/lib32/libCgGL.so 
-- Found GLEW: /usr/lib32/libGLEW.so 
-- Found JPEG: /usr/lib32/libjpeg.so (found version "80")
-- Found PkgConfig: /usr/bin/pkg-config (found version "1.6.1")
-- AIO found
-- LIBUDEV found
-- PORTAUDIO found
-- SOUNDTOUCH found
-- SDL2 found
-- Found X11: /usr/include   
-- Looking for XOpenDisplay in /usr/lib32/libX11.so;/usr/lib32/libXext.so
-- Looking for XOpenDisplay in /usr/lib32/libX11.so;/usr/lib32/libXext.so - found
-- Looking for gethostbyname
-- Looking for gethostbyname - found
-- Looking for connect
-- Looking for connect - found
-- Looking for remove
-- Looking for remove - found
-- Looking for shmat
-- Looking for shmat - found
-- Looking for IceConnectionNumber in ICE
-- Looking for IceConnectionNumber in ICE - found
-- Found GTK2_GTK: /usr/lib32/libgtk-x11-2.0.so 
CMake Warning at cmake/SearchForStuff.cmake:218 (message):
 

      It looks like you are compiling with 9.0.x or 9.1.x. Using these versions is not recommended,
      as there is a bug known to cause the compiler to segfault while compiling. See patch
      https://gitweb.gentoo.org/proj/gcc-patches.git/commit/?id=275ab714637a64672c6630cfd744af2c70957d5a
      Even with that patch, compiling with LTO may still segfault. Use at your own risk!
      This text being in a compile log in an open issue may cause it to be closed.
Call Stack (most recent call first):
  CMakeLists.txt:27 (include)


-- Don't build zerospu2. It is superceded by spu2x
-- Configuring done
-- Generating done
-- Build files have been written to: /build/pcsx2-git/src/pcsx2/build
Scanning dependencies of target translations_pcsx2_Main
Scanning dependencies of target translations_pcsx2_Iconized
[  0%] Generating ../ar_SA__pcsx2_Iconized.gmo
[  0%] Generating ../ar_SA__pcsx2_Main.gmo
Scanning dependencies of target cdvdGigaherz
Scanning dependencies of target x86emitter
[  0%] Generating ../ca_ES__pcsx2_Iconized.gmo
[  1%] Building CXX object plugins/cdvdGigaherz/src/CMakeFiles/cdvdGigaherz.dir/CDVD.cpp.o
[  1%] Building CXX object common/src/x86emitter/CMakeFiles/x86emitter.dir/bmi.cpp.o
[  1%] Generating ../ca_ES__pcsx2_Main.gmo
[  1%] Generating ../cs_CZ__pcsx2_Iconized.gmo
[  2%] Generating ../cs_CZ__pcsx2_Main.gmo
[  3%] Generating ../da_DK__pcsx2_Iconized.gmo
[  3%] Generating ../de_DE__pcsx2_Iconized.gmo
/build/pcsx2-git/src/pcsx2/locales/de_DE/pcsx2_Iconized.po:735: warning: internationalized messages should not contain the '\v' escape sequence
[  3%] Generating ../da_DK__pcsx2_Main.gmo
Scanning dependencies of target Utilities
[  3%] Generating ../es_ES__pcsx2_Iconized.gmo
[  4%] Building CXX object common/src/Utilities/CMakeFiles/Utilities.dir/VirtualMemory.cpp.o
Scanning dependencies of target Utilities_NO_TLS
[  4%] Generating ../de_DE__pcsx2_Main.gmo
[  4%] Generating ../fi_FI__pcsx2_Iconized.gmo
[  5%] Building CXX object common/src/Utilities/CMakeFiles/Utilities_NO_TLS.dir/VirtualMemory.cpp.o
[  5%] Generating ../es_ES__pcsx2_Main.gmo
[  5%] Generating ../fr_FR__pcsx2_Iconized.gmo
[  5%] Generating ../fi_FI__pcsx2_Main.gmo
[  5%] Generating ../hr_HR__pcsx2_Iconized.gmo
[  6%] Generating ../hu_HU__pcsx2_Iconized.gmo
[  6%] Generating ../fr_FR__pcsx2_Main.gmo
[  6%] Generating ../id_ID__pcsx2_Iconized.gmo
[  7%] Generating ../hr_HR__pcsx2_Main.gmo
[  7%] Generating ../it_IT__pcsx2_Iconized.gmo
[  7%] Generating ../hu_HU__pcsx2_Main.gmo
[  7%] Generating ../ja_JP__pcsx2_Iconized.gmo
[  7%] Generating ../id_ID__pcsx2_Main.gmo
[  7%] Generating ../ko_KR__pcsx2_Iconized.gmo
[  7%] Generating ../ms_MY__pcsx2_Iconized.gmo
[  7%] Generating ../it_IT__pcsx2_Main.gmo
[  8%] Generating ../nb_NO__pcsx2_Iconized.gmo
[  8%] Generating ../ja_JP__pcsx2_Main.gmo
[  8%] Generating ../nl_NL__pcsx2_Iconized.gmo
[  8%] Generating ../ko_KR__pcsx2_Main.gmo
[  8%] Generating ../pl_PL__pcsx2_Iconized.gmo
[  9%] Generating ../ms_MY__pcsx2_Main.gmo
[  9%] Generating ../pt_BR__pcsx2_Iconized.gmo
[  9%] Generating ../ru_RU__pcsx2_Iconized.gmo
[  9%] Generating ../nb_NO__pcsx2_Main.gmo
[  9%] Generating ../sv_SE__pcsx2_Iconized.gmo
[  9%] Building CXX object plugins/cdvdGigaherz/src/CMakeFiles/cdvdGigaherz.dir/ReadThread.cpp.o
[  9%] Generating ../nl_NL__pcsx2_Main.gmo
[ 10%] Generating ../th_TH__pcsx2_Iconized.gmo
[ 10%] Generating ../pl_PL__pcsx2_Main.gmo
[ 10%] Generating ../tr_TR__pcsx2_Iconized.gmo
[ 10%] Generating ../zh_CN__pcsx2_Iconized.gmo
[ 10%] Generating ../pt_BR__pcsx2_Main.gmo
[ 10%] Generating ../zh_TW__pcsx2_Iconized.gmo
[ 10%] Generating ../ru_RU__pcsx2_Main.gmo
[ 10%] Built target translations_pcsx2_Iconized
[ 10%] Building CXX object plugins/cdvdGigaherz/src/CMakeFiles/cdvdGigaherz.dir/Settings.cpp.o
[ 11%] Generating ../sv_SE__pcsx2_Main.gmo
[ 12%] Building CXX object common/src/x86emitter/CMakeFiles/x86emitter.dir/cpudetect.cpp.o
[ 12%] Generating ../th_TH__pcsx2_Main.gmo
[ 12%] Generating ../tr_TR__pcsx2_Main.gmo
[ 12%] Generating ../zh_CN__pcsx2_Main.gmo
[ 12%] Generating ../zh_TW__pcsx2_Main.gmo
[ 12%] Built target translations_pcsx2_Main
[ 12%] Building CXX object common/src/Utilities/CMakeFiles/Utilities.dir/AlignedMalloc.cpp.o
[ 12%] Building CXX object common/src/Utilities/CMakeFiles/Utilities_NO_TLS.dir/AlignedMalloc.cpp.o
[ 12%] Building CXX object common/src/Utilities/CMakeFiles/Utilities.dir/CheckedStaticBox.cpp.o
[ 12%] Building CXX object common/src/x86emitter/CMakeFiles/x86emitter.dir/fpu.cpp.o
[ 12%] Building CXX object plugins/cdvdGigaherz/src/CMakeFiles/cdvdGigaherz.dir/TocStuff.cpp.o
[ 12%] Building CXX object common/src/x86emitter/CMakeFiles/x86emitter.dir/groups.cpp.o
[ 12%] Building CXX object common/src/Utilities/CMakeFiles/Utilities.dir/Console.cpp.o
[ 12%] Building CXX object plugins/cdvdGigaherz/src/CMakeFiles/cdvdGigaherz.dir/Unix/GtkGui.cpp.o
[ 12%] Building CXX object plugins/cdvdGigaherz/src/CMakeFiles/cdvdGigaherz.dir/Unix/LinuxConfig.cpp.o
[ 12%] Building CXX object common/src/x86emitter/CMakeFiles/x86emitter.dir/jmp.cpp.o
[ 12%] Building CXX object common/src/Utilities/CMakeFiles/Utilities.dir/Exceptions.cpp.o
[ 12%] Building CXX object common/src/Utilities/CMakeFiles/Utilities.dir/EventSource.cpp.o
Scanning dependencies of target CDVDnull
[ 12%] Building CXX object plugins/CDVDnull/CMakeFiles/CDVDnull.dir/CDVD.cpp.o
[ 13%] Building CXX object plugins/cdvdGigaherz/src/CMakeFiles/cdvdGigaherz.dir/Unix/LinuxIOCtlSrc.cpp.o
[ 13%] Linking CXX shared module libCDVDnull.so
/usr/bin/ld: warning: /usr/lib32/ld-linux.so.2: corrupt GNU_PROPERTY_TYPE (5) size: 0
[ 13%] Built target CDVDnull
[ 13%] Linking CXX shared module libcdvdGigaherz.so
Scanning dependencies of target dev9null-0.5.0
[ 13%] Building CXX object plugins/dev9null/CMakeFiles/dev9null-0.5.0.dir/DEV9.cpp.o
[ 13%] Building CXX object common/src/x86emitter/CMakeFiles/x86emitter.dir/legacy.cpp.o
/usr/bin/ld: warning: /usr/lib32/ld-linux.so.2: corrupt GNU_PROPERTY_TYPE (5) size: 0
[ 13%] Built target cdvdGigaherz
[ 13%] Creating gresources XML file (.gresource.xml)
[ 13%] Generating resources.c
[ 13%] Generating resources.h
Scanning dependencies of target dev9ghzdrk-0.4
[ 13%] Building CXX object plugins/dev9ghzdrk/CMakeFiles/dev9ghzdrk-0.4.dir/smap.cpp.o
[ 14%] Building CXX object common/src/Utilities/CMakeFiles/Utilities.dir/FastFormatString.cpp.o
[ 14%] Linking CXX shared module libdev9null-0.5.0.so
/usr/bin/ld: warning: /usr/lib32/ld-linux.so.2: corrupt GNU_PROPERTY_TYPE (5) size: 0
[ 14%] Built target dev9null-0.5.0
Scanning dependencies of target FWnull-0.7.0
[ 14%] Building CXX object plugins/FWnull/CMakeFiles/FWnull-0.7.0.dir/FW.cpp.o
[ 15%] Generating GSdxResources.h
[ 15%] Generating GSdxResources.cpp
[ 16%] Building CXX object plugins/dev9ghzdrk/CMakeFiles/dev9ghzdrk-0.4.dir/DEV9.cpp.o
[ 16%] Building CXX object common/src/x86emitter/CMakeFiles/x86emitter.dir/legacy_sse.cpp.o
Scanning dependencies of target GSdx
[ 16%] Building CXX object plugins/GSdx/CMakeFiles/GSdx.dir/PSX/GPU.cpp.o
[ 16%] Linking CXX shared module libFWnull-0.7.0.so
[ 16%] Building CXX object common/src/Utilities/CMakeFiles/Utilities.dir/IniInterface.cpp.o
/usr/bin/ld: warning: /usr/lib32/ld-linux.so.2: corrupt GNU_PROPERTY_TYPE (5) size: 0
[ 16%] Built target FWnull-0.7.0
[ 17%] Building CXX object common/src/x86emitter/CMakeFiles/x86emitter.dir/movs.cpp.o
[ 17%] Building CXX object plugins/dev9ghzdrk/CMakeFiles/dev9ghzdrk-0.4.dir/flash.cpp.o
[ 17%] Building CXX object common/src/x86emitter/CMakeFiles/x86emitter.dir/PrecompiledHeader.cpp.o
/build/pcsx2-git/src/pcsx2/plugins/dev9ghzdrk/flash.cpp: In function ‘void FLASHwrite32(u32, u32, int)’:
/build/pcsx2-git/src/pcsx2/plugins/dev9ghzdrk/flash.cpp:215:9: warning: variable ‘bytes’ set but not used [-Wunused-but-set-variable]
  215 |     u32 bytes, pages, blocks;
      |         ^~~~~
[ 17%] Building CXX object plugins/dev9ghzdrk/CMakeFiles/dev9ghzdrk-0.4.dir/pcap_io.cpp.o
[ 17%] Building CXX object common/src/x86emitter/CMakeFiles/x86emitter.dir/simd.cpp.o
cc1plus: internal compiler error: Segmentation fault
Please submit a full bug report,
with preprocessed source if appropriate.
See <https://bugs.archlinux.org/> for instructions.
make[2]: *** [plugins/GSdx/CMakeFiles/GSdx.dir/build.make:91: plugins/GSdx/CMakeFiles/GSdx.dir/PSX/GPU.cpp.o] Error 1
[ 17%] Building CXX object plugins/dev9ghzdrk/CMakeFiles/dev9ghzdrk-0.4.dir/Linux/Config.cpp.o
[ 17%] Building CXX object common/src/x86emitter/CMakeFiles/x86emitter.dir/x86emitter.cpp.o
[ 17%] Building CXX object plugins/dev9ghzdrk/CMakeFiles/dev9ghzdrk-0.4.dir/Linux/Linux.cpp.o
[ 17%] Building CXX object plugins/dev9ghzdrk/CMakeFiles/dev9ghzdrk-0.4.dir/Linux/net.cpp.o
make[1]: *** [CMakeFiles/Makefile2:722: plugins/GSdx/CMakeFiles/GSdx.dir/all] Error 2
make[1]: *** Waiting for unfinished jobs....
[ 17%] Building CXX object common/src/Utilities/CMakeFiles/Utilities.dir/Linux/LnxHostSys.cpp.o
[ 17%] Building CXX object common/src/Utilities/CMakeFiles/Utilities.dir/Mutex.cpp.o
Scanning dependencies of target GSnull
[ 17%] Building CXX object plugins/GSnull/CMakeFiles/GSnull.dir/GifTransfer.cpp.o
/build/pcsx2-git/src/pcsx2/plugins/dev9ghzdrk/Linux/net.cpp: In function ‘void InitNet(NetAdapter*)’:
/build/pcsx2-git/src/pcsx2/plugins/dev9ghzdrk/Linux/net.cpp:58:12: warning: unused variable ‘ret’ [-Wunused-variable]
   58 |        int ret = pthread_create(&rx_thread, NULL, NetRxThread, NULL);
      |            ^~~
[ 17%] Building CXX object common/src/x86emitter/CMakeFiles/x86emitter.dir/LnxCpuDetect.cpp.o
[ 18%] Building C object plugins/dev9ghzdrk/CMakeFiles/dev9ghzdrk-0.4.dir/resources.c.o
[ 18%] Linking CXX shared module libdev9ghzdrk-0.4.so
/usr/bin/ld: warning: /usr/lib32/ld-linux.so.2: corrupt GNU_PROPERTY_TYPE (5) size: 0
[ 18%] Built target dev9ghzdrk-0.4
[ 18%] Building CXX object plugins/GSnull/CMakeFiles/GSnull.dir/GS.cpp.o
[ 18%] Building CXX object plugins/GSnull/CMakeFiles/GSnull.dir/GSLog.cpp.o
[ 19%] Building CXX object plugins/GSnull/CMakeFiles/GSnull.dir/Registers.cpp.o
[ 19%] Building CXX object common/src/Utilities/CMakeFiles/Utilities.dir/PathUtils.cpp.o
[ 20%] Linking CXX static library libx86emitter.a
[ 20%] Built target x86emitter
[ 20%] Building CXX object common/src/Utilities/CMakeFiles/Utilities.dir/PrecompiledHeader.cpp.o
[ 20%] Building CXX object common/src/Utilities/CMakeFiles/Utilities_NO_TLS.dir/CheckedStaticBox.cpp.o
[ 21%] Building CXX object common/src/Utilities/CMakeFiles/Utilities.dir/Perf.cpp.o
[ 21%] Building CXX object plugins/GSnull/CMakeFiles/GSnull.dir/null/GSnull.cpp.o
[ 21%] Building CXX object common/src/Utilities/CMakeFiles/Utilities.dir/pxCheckBox.cpp.o
[ 21%] Building CXX object common/src/Utilities/CMakeFiles/Utilities_NO_TLS.dir/Console.cpp.o
[ 21%] Building CXX object plugins/GSnull/CMakeFiles/GSnull.dir/Linux/Config.cpp.o
[ 21%] Building CXX object common/src/Utilities/CMakeFiles/Utilities.dir/pxRadioPanel.cpp.o
[ 21%] Building CXX object plugins/GSnull/CMakeFiles/GSnull.dir/Linux/GSLinux.cpp.o
[ 21%] Building CXX object common/src/Utilities/CMakeFiles/Utilities.dir/pxStaticText.cpp.o
[ 21%] Building CXX object plugins/GSnull/CMakeFiles/GSnull.dir/Linux/Linux.cpp.o
[ 21%] Building CXX object common/src/Utilities/CMakeFiles/Utilities_NO_TLS.dir/EventSource.cpp.o
[ 21%] Building CXX object common/src/Utilities/CMakeFiles/Utilities_NO_TLS.dir/Exceptions.cpp.o
[ 22%] Building CXX object common/src/Utilities/CMakeFiles/Utilities_NO_TLS.dir/FastFormatString.cpp.o
[ 23%] Linking CXX shared module libGSnull.so
/usr/bin/ld: warning: /usr/lib32/ld-linux.so.2: corrupt GNU_PROPERTY_TYPE (5) size: 0
[ 23%] Built target GSnull
[ 23%] Building CXX object common/src/Utilities/CMakeFiles/Utilities_NO_TLS.dir/IniInterface.cpp.o
[ 23%] Building CXX object common/src/Utilities/CMakeFiles/Utilities.dir/pxStreams.cpp.o
[ 23%] Building CXX object common/src/Utilities/CMakeFiles/Utilities.dir/pxTranslate.cpp.o
[ 24%] Building CXX object common/src/Utilities/CMakeFiles/Utilities.dir/pxWindowTextWriter.cpp.o
[ 24%] Building CXX object common/src/Utilities/CMakeFiles/Utilities_NO_TLS.dir/Linux/LnxHostSys.cpp.o
[ 24%] Building CXX object common/src/Utilities/CMakeFiles/Utilities.dir/RwMutex.cpp.o
[ 24%] Building CXX object common/src/Utilities/CMakeFiles/Utilities_NO_TLS.dir/Mutex.cpp.o
[ 24%] Building CXX object common/src/Utilities/CMakeFiles/Utilities.dir/StringHelpers.cpp.o
[ 24%] Building CXX object common/src/Utilities/CMakeFiles/Utilities.dir/ThreadingDialogs.cpp.o
[ 24%] Building CXX object common/src/Utilities/CMakeFiles/Utilities_NO_TLS.dir/PathUtils.cpp.o
[ 24%] Building CXX object common/src/Utilities/CMakeFiles/Utilities.dir/ThreadTools.cpp.o
[ 24%] Building CXX object common/src/Utilities/CMakeFiles/Utilities.dir/wxAppWithHelpers.cpp.o
[ 25%] Building CXX object common/src/Utilities/CMakeFiles/Utilities.dir/wxGuiTools.cpp.o
[ 25%] Building CXX object common/src/Utilities/CMakeFiles/Utilities.dir/wxHelpers.cpp.o
[ 25%] Building CXX object common/src/Utilities/CMakeFiles/Utilities_NO_TLS.dir/PrecompiledHeader.cpp.o
[ 26%] Building CXX object common/src/Utilities/CMakeFiles/Utilities_NO_TLS.dir/Perf.cpp.o
[ 26%] Building CXX object common/src/Utilities/CMakeFiles/Utilities.dir/Linux/LnxThreads.cpp.o
[ 26%] Building CXX object common/src/Utilities/CMakeFiles/Utilities.dir/Linux/LnxMisc.cpp.o
[ 26%] Building CXX object common/src/Utilities/CMakeFiles/Utilities_NO_TLS.dir/pxCheckBox.cpp.o
[ 26%] Building CXX object common/src/Utilities/CMakeFiles/Utilities.dir/Semaphore.cpp.o
[ 26%] Building CXX object common/src/Utilities/CMakeFiles/Utilities_NO_TLS.dir/pxRadioPanel.cpp.o
[ 26%] Building CXX object common/src/Utilities/CMakeFiles/Utilities_NO_TLS.dir/pxStaticText.cpp.o
[ 26%] Building CXX object common/src/Utilities/CMakeFiles/Utilities_NO_TLS.dir/pxStreams.cpp.o
[ 26%] Building CXX object common/src/Utilities/CMakeFiles/Utilities_NO_TLS.dir/pxTranslate.cpp.o
[ 26%] Linking CXX static library libUtilities.a
[ 27%] Building CXX object common/src/Utilities/CMakeFiles/Utilities_NO_TLS.dir/pxWindowTextWriter.cpp.o
[ 27%] Building CXX object common/src/Utilities/CMakeFiles/Utilities_NO_TLS.dir/RwMutex.cpp.o
[ 27%] Building CXX object common/src/Utilities/CMakeFiles/Utilities_NO_TLS.dir/StringHelpers.cpp.o
[ 27%] Built target Utilities
[ 27%] Building CXX object common/src/Utilities/CMakeFiles/Utilities_NO_TLS.dir/ThreadingDialogs.cpp.o
[ 27%] Building CXX object common/src/Utilities/CMakeFiles/Utilities_NO_TLS.dir/ThreadTools.cpp.o
[ 27%] Building CXX object common/src/Utilities/CMakeFiles/Utilities_NO_TLS.dir/wxAppWithHelpers.cpp.o
[ 28%] Building CXX object common/src/Utilities/CMakeFiles/Utilities_NO_TLS.dir/wxGuiTools.cpp.o
[ 28%] Building CXX object common/src/Utilities/CMakeFiles/Utilities_NO_TLS.dir/wxHelpers.cpp.o
[ 28%] Building CXX object common/src/Utilities/CMakeFiles/Utilities_NO_TLS.dir/Linux/LnxThreads.cpp.o
[ 28%] Building CXX object common/src/Utilities/CMakeFiles/Utilities_NO_TLS.dir/Linux/LnxMisc.cpp.o
[ 28%] Building CXX object common/src/Utilities/CMakeFiles/Utilities_NO_TLS.dir/Semaphore.cpp.o
[ 28%] Linking CXX static library libUtilities_NO_TLS.a
[ 28%] Built target Utilities_NO_TLS
make: *** [Makefile:130: all] Error 2
==> ERROR: A failure occurred in build().
    Aborting...
Reply
(07-14-2019, 10:46 PM)josephg Wrote: Strange. I am unable to reproduce that error. Consider cleaning the source directory ($srcdir) before building. You can use -C flag with makepkg or -c flag with makechrootpkg (last one is if you are building in a clean chroot)

Eh, it'll cost me nothing to go through the process again. Lemme just grab the PCSX installation guide.

So I've confirmed that multilib is enabled (i.e. both present and not excluded through comments)

I've rm -rf'd the git folder. I also (prior to this) downgraded my GCC to 8.3.

Code:
[[email protected] Consoles & Emulators]$ git clone https://aur.archlinux.org/pcsx2-git.git
Cloning into 'pcsx2-git'...
remote: Enumerating objects: 40, done.
remote: Counting objects: 100% (40/40), done.
remote: Compressing objects: 100% (38/38), done.
remote: Total 40 (delta 2), reused 39 (delta 2)
Unpacking objects: 100% (40/40), done.
[[email protected] Consoles & Emulators]$ cd pcsx2-git && makepkg -csiC

Then...

Code:
==> Making package: pcsx2-git 1.5.0.r2255.43d0bd99c-1 (Sun 14 Jul 2019 22:08:31 BST)
==> Checking runtime dependencies...
==> Checking buildtime dependencies...
==> Retrieving sources...
  -> Updating pcsx2 git repo...
Fetching origin
remote: Enumerating objects: 7, done.
remote: Counting objects: 100% (7/7), done.
remote: Compressing objects: 100% (7/7), done.
remote: Total 144846 (delta 2), reused 0 (delta 0), pack-reused 144839
Receiving objects: 100% (144846/144846), 105.96 MiB | 657.00 KiB/s, done.
Resolving deltas: 100% (111585/111585), done.
From https://github.com/PCSX2/pcsx2
* [new branch]      0.9.8                            -> 0.9.8
* [new branch]      1.0                              -> 1.0
* [new branch]      1.2.x                            -> 1.2.x
* [new branch]      1.4.x                            -> 1.4.x
* [new branch]      3kinox-64-bit-clean              -> 3kinox-64-bit-clean
* [new branch]      DelayDisplayrectTransistion      -> DelayDisplayrectTransistion
* [new branch]      alternative--vsynctiming         -> alternative--vsynctiming
* [new branch]      cdvd                             -> cdvd
* [new branch]      cheats_ws                        -> cheats_ws
* [new branch]      clang-tidy                       -> clang-tidy
* [new branch]      d3d11-wip-domerge                -> d3d11-wip-domerge
* [new branch]      debugger                         -> debugger
* [new branch]      defaults                         -> defaults
* [new branch]      disable-memory-protect-ee-kernel -> disable-memory-protect-ee-kernel
* [new branch]      flatout_aspectratio              -> flatout_aspectratio
* [new branch]      fpu-double                       -> fpu-double
* [new branch]      gigaherz-legacy-wip-iopdma       -> gigaherz-legacy-wip-iopdma
* [new branch]      greg/xz                          -> greg/xz
* [new branch]      gsdx-dialog                      -> gsdx-dialog
* [new branch]      gsdx_legacy_purge                -> gsdx_legacy_purge
* [new branch]      master                           -> master
* [new branch]      masterx                          -> masterx
* [new branch]      newdmac                          -> newdmac
* [new branch]      onepad-next                      -> onepad-next
* [new branch]      pcsx2-mbit                       -> pcsx2-mbit
* [new branch]      pcsx2-playground-legacy          -> pcsx2-playground-legacy
-------Whoops too long, had to snip--------
* [new ref]         refs/pull/990/head               -> refs/pull/990/head
* [new ref]         refs/pull/991/head               -> refs/pull/991/head
* [new ref]         refs/pull/993/head               -> refs/pull/993/head
* [new ref]         refs/pull/994/head               -> refs/pull/994/head
* [new tag]         v0.9.6                           -> v0.9.6
* [new tag]         v1.0                             -> v1.0
* [new tag]         v1.2                             -> v1.2
* [new tag]         v1.2.1                           -> v1.2.1
* [new tag]         v1.2.2                           -> v1.2.2
* [new tag]         v1.3.1                           -> v1.3.1
* [new tag]         v1.4.0                           -> v1.4.0
* [new tag]         v1.4.0-rc1                       -> v1.4.0-rc1
* [new tag]         v1.5.0-dev                       -> v1.5.0-dev
==> Validating source files with sha256sums...
    pcsx2 ... Skipped
==> Removing existing $srcdir/ directory...
==> Extracting sources...
  -> Creating working copy of pcsx2 git repo...
Cloning into 'pcsx2'...
done.
==> Starting prepare()...
==> Starting pkgver()...
==> Updated version: pcsx2-git 1.5.0.r3199.2f8932e37-1
==> Starting build()...
-- The C compiler identification is GNU 8.3.0
-- The CXX compiler identification is GNU 8.3.0
-- Check for working C compiler: /usr/bin/cc
-- Check for working C compiler: /usr/bin/cc -- works
-- Detecting C compiler ABI info
-- Detecting C compiler ABI info - done
-- Detecting C compile features
-- Detecting C compile features - done
-- Check for working CXX compiler: /usr/bin/c++
-- Check for working CXX compiler: /usr/bin/c++ -- works
-- Detecting CXX compiler ABI info
-- Detecting CXX compiler ABI info - done
-- Detecting CXX compile features
-- Detecting CXX compile features - done
-- Building with GNU GCC
-- Enable the building of po files by default in Release build !!!
-- Cross compilation is enabled.
-- Compiling a i386 build on a x86_64 host.
-- Found ALSA: /usr/lib32/libasound.so (found version "1.1.9")
-- Found PCAP: /usr/lib32/libpcap.so 
-- Performing Test PCAP_LINKS_SOLO
-- Performing Test PCAP_LINKS_SOLO - Success
-- Looking for pcap_get_pfring_id
-- Looking for pcap_get_pfring_id - not found
-- Found LibXml2: /usr/lib32/libxml2.so (found version "2.9.9")
-- Found Freetype: /usr/lib32/libfreetype.so (found version "2.10.1")
-- Found Gettext: /usr/bin/msgmerge (found version "0.19.8.1")
-- Found Git: /usr/bin/git (found version "2.22.0")
-- Looking for lzma_auto_decoder in /usr/lib32/liblzma.so
-- Looking for lzma_auto_decoder in /usr/lib32/liblzma.so - found
-- Looking for lzma_easy_encoder in /usr/lib32/liblzma.so
-- Looking for lzma_easy_encoder in /usr/lib32/liblzma.so - found
-- Looking for lzma_lzma_preset in /usr/lib32/liblzma.so
-- Looking for lzma_lzma_preset in /usr/lib32/liblzma.so - found
-- Found LibLZMA: /usr/lib32/liblzma.so (found version "5.2.4")
-- Found OpenGL: /usr/lib32/libOpenGL.so  
-- Found ZLIB: /usr/lib32/libz.so (found version "1.2.11")
-- Found PNG: /usr/lib32/libpng.so (found version "1.6.37")
-- Could NOT find Vtune (missing: VTUNE_LIBRARIES VTUNE_INCLUDE_DIRS)
-- Found wxWidgets: -L/usr/lib32;-pthread;;;-lwx_baseu-3.0;-lwx_gtk2u_core-3.0;-lwx_gtk2u_adv-3.0 (found version "3.0.4")
-- Found Libc: /usr/lib32/librt.so;/usr/lib32/libdl.so;/usr/lib32/libm.so 
-- Found Cg: /usr/lib32/libCg.so;/usr/lib32/libCgGL.so 
-- Found GLEW: /usr/lib32/libGLEW.so 
-- Found JPEG: /usr/lib32/libjpeg.so (found version "80")
-- Found PkgConfig: /usr/bin/pkg-config (found version "1.6.1")
-- AIO found
-- LIBUDEV found
-- PORTAUDIO found
-- SOUNDTOUCH found
-- SDL2 found
-- Found X11: /usr/include  
-- Looking for XOpenDisplay in /usr/lib32/libX11.so;/usr/lib32/libXext.so
-- Looking for XOpenDisplay in /usr/lib32/libX11.so;/usr/lib32/libXext.so - found
-- Looking for gethostbyname
-- Looking for gethostbyname - found
-- Looking for connect
-- Looking for connect - found
-- Looking for remove
-- Looking for remove - found
-- Looking for shmat
-- Looking for shmat - found
-- Looking for IceConnectionNumber in ICE
-- Looking for IceConnectionNumber in ICE - found
-- Found GTK2_GTK: /usr/lib32/libgtk-x11-2.0.so 
-- Don't build zerospu2. It is superceded by spu2x
-- Configuring done
-- Generating done
-- Build files have been written to: /data/Games/Consoles & Emulators/pcsx2-git/src/pcsx2/build
Scanning dependencies of target translations_pcsx2_Main
[  0%] Generating ../ar_SA__pcsx2_Main.gmo
/bin/sh:  Emulators/pcsx2-git/src/pcsx2/locales/ar_SA/pcsx2_Main.po: No such file or directory
/bin/sh:  Emulators/pcsx2-git/src/pcsx2/locales/templates/pcsx2_Main.pot: No such file or directory
make[2]: *** [locales/CMakeFiles/translations_pcsx2_Main.dir/build.make:86: ar_SA__pcsx2_Main.gmo] Error 127
make[1]: *** [CMakeFiles/Makefile2:93: locales/CMakeFiles/translations_pcsx2_Main.dir/all] Error 2
make: *** [Makefile:130: all] Error 2
/usr/bin/msgmerge: exactly 2 input files required
Try '/usr/bin/msgmerge --help' for more information.
==> ERROR: A failure occurred in build().
    Aborting...

As you can see, not going well at all ._.
Reply




Users browsing this thread: 1 Guest(s)