Thread Rating:
  • 17 Vote(s) - 3.71 Average
  • 1
  • 2
  • 3
  • 4
  • 5
Compile Guide
zeydlitz, thanks for the info.
1 to 3 ain't too hard to accomplish, but i have quite some trouble compiling bin2cpp. could you perhaps be a little more specific about how to do that? thanks!

[edit] lol, forget it: remove the ";" at line 176 and it compiles ;-)
let's see about the rest of pcsx2 now...[/edit]

[edit2] ran rebuild.sh - no problem, it generates some header files.
but once i try to compile the whole project in codeblocks it throws an "error: the chosen cpu does not support the x86-64 command set". i suppose i do have to tell codeblocks that i want the x86-32 version to be compiled? i should have all necessary 32 bit libraries, so that should not be the problem. help will be appreciated.[/edit2]
Reply

Sponsored links

i have 1 error

Error 35 fatal error RC1004: unexpected end of file found c:\Dokumente und Einstellungen\Norman\Desktop\PCSX2 SVN\plugins\spu2-x\src\Windows\svnrev.h 23 SPU2-X

pls help^^

here are my complete log.. Ninja

Code:
Warning    1    warning C4065: switch statement contains 'default' but no 'case' labels    c:\Dokumente und Einstellungen\Norman\Desktop\PCSX2 SVN\plugins\FWnull\FW.cpp    136    FWnull
Warning    2    warning LNK4199: /DELAYLOAD:d3d9.dll ignored; no imports found from d3d9.dll    CDVDolio    CDVDolio
Warning    3    warning LNK4199: /DELAYLOAD:d3dx9_40.dll ignored; no imports found from d3dx9_40.dll    CDVDolio    CDVDolio
Warning    4    warning LNK4199: /DELAYLOAD:d3d10.dll ignored; no imports found from d3d10.dll    CDVDolio    CDVDolio
Warning    5    warning LNK4199: /DELAYLOAD:d3dx10_40.dll ignored; no imports found from d3dx10_40.dll    CDVDolio    CDVDolio
Warning    6    warning LNK4199: /DELAYLOAD:d3d9.dll ignored; no imports found from d3d9.dll    xpad    xpad
Warning    7    warning LNK4199: /DELAYLOAD:d3dx9_40.dll ignored; no imports found from d3dx9_40.dll    xpad    xpad
Warning    8    warning LNK4199: /DELAYLOAD:d3d10.dll ignored; no imports found from d3d10.dll    xpad    xpad
Warning    9    warning LNK4199: /DELAYLOAD:d3dx10_40.dll ignored; no imports found from d3dx10_40.dll    xpad    xpad
Warning    10    warning C4189: 'dx11' : local variable is initialized but not referenced    c:\Dokumente und Einstellungen\Norman\Desktop\PCSX2 SVN\plugins\GSdx\GSSettingsDlg.cpp    209    GSdx
Warning    11    warning C4189: 'ogl' : local variable is initialized but not referenced    c:\Dokumente und Einstellungen\Norman\Desktop\PCSX2 SVN\plugins\GSdx\GSSettingsDlg.cpp    210    GSdx
Warning    12    warning C4244: '=' : conversion from 'const int' to 'uint16', possible loss of data    c:\Dokumente und Einstellungen\Norman\Desktop\PCSX2 SVN\plugins\GSdx\GSDrawScanline.cpp    119    GSdx
Warning    13    warning C4244: '=' : conversion from 'const int' to 'uint16', possible loss of data    c:\Dokumente und Einstellungen\Norman\Desktop\PCSX2 SVN\plugins\GSdx\GSDrawScanline.cpp    120    GSdx
Warning    14    warning C4244: '=' : conversion from 'const int' to 'uint16', possible loss of data    c:\Dokumente und Einstellungen\Norman\Desktop\PCSX2 SVN\plugins\GSdx\GSDrawScanline.cpp    145    GSdx
Warning    15    warning C4244: '=' : conversion from 'const int' to 'uint16', possible loss of data    c:\Dokumente und Einstellungen\Norman\Desktop\PCSX2 SVN\plugins\GSdx\GSDrawScanline.cpp    146    GSdx
Warning    16    warning C4189: 'str' : local variable is initialized but not referenced    c:\Dokumente und Einstellungen\Norman\Desktop\PCSX2 SVN\plugins\GSdx\GSDeviceOGL.cpp    134    GSdx
Warning    17    warning C4189: 'dx11' : local variable is initialized but not referenced    c:\Dokumente und Einstellungen\Norman\Desktop\PCSX2 SVN\plugins\GSdx\GPUSettingsDlg.cpp    195    GSdx
Warning    18    warning C4244: '=' : conversion from 'uint32' to 'uint16', possible loss of data    c:\Dokumente und Einstellungen\Norman\Desktop\PCSX2 SVN\plugins\GSdx\GSLocalMemory.cpp    1310    GSdx
Warning    19    warning C4244: '=' : conversion from 'uint32' to 'uint8', possible loss of data    c:\Dokumente und Einstellungen\Norman\Desktop\PCSX2 SVN\plugins\GSdx\GSLocalMemory.cpp    1327    GSdx
Warning    20    warning C4244: '=' : conversion from 'uint32' to 'uint8', possible loss of data    c:\Dokumente und Einstellungen\Norman\Desktop\PCSX2 SVN\plugins\GSdx\GSLocalMemory.cpp    1344    GSdx
Warning    21    warning C4244: '=' : conversion from 'uint32' to 'uint8', possible loss of data    c:\Dokumente und Einstellungen\Norman\Desktop\PCSX2 SVN\plugins\GSdx\GSLocalMemory.cpp    1361    GSdx
Warning    22    warning C4244: '=' : conversion from 'uint32' to 'uint8', possible loss of data    c:\Dokumente und Einstellungen\Norman\Desktop\PCSX2 SVN\plugins\GSdx\GSLocalMemory.cpp    1378    GSdx
Warning    23    warning C4244: '=' : conversion from 'uint32' to 'uint8', possible loss of data    c:\Dokumente und Einstellungen\Norman\Desktop\PCSX2 SVN\plugins\GSdx\GSLocalMemory.cpp    1395    GSdx
Warning    24    warning LNK4070: /OUT:GSdx.dll directive in .EXP differs from output filename 'C:\Dokumente und Einstellungen\Norman\Desktop\PCSX2 SVN\\bin\plugins\GSdx-SSE4.dll'; ignoring directive    GSdx-SSE4.exp    GSdx
Warning    25    warning C4706: assignment within conditional expression    c:\dokumente und einstellungen\norman\desktop\pcsx2 svn\plugins\gsdx\baseclasses\wxutil.cpp    420    GSdx
Warning    26    warning C4706: assignment within conditional expression    c:\dokumente und einstellungen\norman\desktop\pcsx2 svn\plugins\gsdx\baseclasses\schedule.cpp    120    GSdx
Warning    27    warning C4701: potentially uninitialized local variable 'ppacket' used    c:\dokumente und einstellungen\norman\desktop\pcsx2 svn\plugins\gsdx\baseclasses\outputq.cpp    366    GSdx
Warning    28    warning C4701: potentially uninitialized local variable 'lNumberToSend' used    c:\dokumente und einstellungen\norman\desktop\pcsx2 svn\plugins\gsdx\baseclasses\outputq.cpp    312    GSdx
Warning    29    warning C4701: potentially uninitialized local variable 'Actual' used    c:\dokumente und einstellungen\norman\desktop\pcsx2 svn\plugins\gsdx\baseclasses\transip.cpp    772    GSdx
Warning    30    warning LNK4070: /OUT:GSdx.dll directive in .EXP differs from output filename 'C:\Dokumente und Einstellungen\Norman\Desktop\PCSX2 SVN\\bin\plugins\GSdx-SSE4.dll'; ignoring directive    GSdx-SSE4.exp    GSdx
Warning    31    warning LNK4199: /DELAYLOAD:d3d10.dll ignored; no imports found from d3d10.dll    GSdx    GSdx
Warning    32    warning LNK4199: /DELAYLOAD:d3d11.dll ignored; no imports found from d3d11.dll    GSdx    GSdx
Warning    33    warning LNK4199: /DELAYLOAD:cgGL.dll ignored; no imports found from cgGL.dll    GSdx    GSdx
Warning    34    warning LNK4199: /DELAYLOAD:glut32.dll ignored; no imports found from glut32.dll    GSdx    GSdx
Error    35    fatal error RC1004: unexpected end of file found    c:\Dokumente und Einstellungen\Norman\Desktop\PCSX2 SVN\plugins\spu2-x\src\Windows\svnrev.h    23    SPU2-X
Warning    36    warning C4244: '=' : conversion from 'u64' to 'int', possible loss of data    c:\Dokumente und Einstellungen\Norman\Desktop\PCSX2 SVN\plugins\CDVDiso\src\libiso.cpp    266    CDVDiso
Warning    37    warning C4244: '=' : conversion from 'u64' to 'int', possible loss of data    c:\Dokumente und Einstellungen\Norman\Desktop\PCSX2 SVN\plugins\CDVDiso\src\libiso.cpp    300    CDVDiso
Warning    38    warning C4244: '=' : conversion from 'u64' to 'int', possible loss of data    c:\Dokumente und Einstellungen\Norman\Desktop\PCSX2 SVN\plugins\CDVDiso\src\libiso.cpp    351    CDVDiso
Warning    39    warning C4244: '=' : conversion from 'u64' to 'int', possible loss of data    c:\Dokumente und Einstellungen\Norman\Desktop\PCSX2 SVN\plugins\CDVDiso\src\libiso.cpp    389    CDVDiso
Warning    40    warning C4244: '=' : conversion from 'unsigned long' to 'u8', possible loss of data    c:\Dokumente und Einstellungen\Norman\Desktop\PCSX2 SVN\plugins\zerogs\dx\Windows\Conf.cpp    73    ZeroGS
Warning    41    warning C4060: switch statement contains no 'case' or 'default' labels    c:\Dokumente und Einstellungen\Norman\Desktop\PCSX2 SVN\pcsx2\gui\Dialogs\LogOptionsDialog.cpp    155    pcsx2
My PC:
Intel i7 920 @ 4010 Mhz
2x 2 GB Dual-DDR 3 @ 1200 Mhz
NVIDIA GTX 260 @ (GPU/Shader/RAM) 640/1380/1000 Mhz
2x Seagate Barracuda 7200.12 at Raid0
Reply
I has this problem when i try to compile pcsx2.
What could be??
Code:
C:\Archivos de programa\Microsoft SDKs\Windows\v6.0A\include\shlwapi.h(196) : error C2061: error de sintaxis : identificador 'PCUITEMID_CHILD'
C:\Archivos de programa\Microsoft SDKs\Windows\v6.0A\include\shlwapi.h(197) : error C2061: error de sintaxis : identificador 'PCUITEMID_CHILD'
C:\Archivos de programa\Microsoft SDKs\Windows\v6.0A\include\shlwapi.h(203) : error C2061: error de sintaxis : identificador 'PCUITEMID_CHILD'
C:\Archivos de programa\Microsoft SDKs\Windows\v6.0A\include\shlwapi.h(204) : error C2061: error de sintaxis : identificador 'PCUITEMID_CHILD'
C:\Archivos de programa\Microsoft SDKs\Windows\v6.0A\include\shlwapi.h(243) : error C2061: error de sintaxis : identificador 'PCUITEMID_CHILD'
C:\Archivos de programa\Microsoft SDKs\Windows\v6.0A\include\shlwapi.h(1041) : error C2143: error de sintaxis : falta ';' delante de '__stdcall'
C:\Archivos de programa\Microsoft SDKs\Windows\v6.0A\include\shlwapi.h(1041) : error C4430: falta el especificador de tipo; se presupone int. Nota: C++ no admite default-int
C:\Archivos de programa\Microsoft SDKs\Windows\v6.0A\include\shlwapi.h(1041) : error C4430: falta el especificador de tipo; se presupone int. Nota: C++ no admite default-int
C:\Archivos de programa\Microsoft SDKs\Windows\v6.0A\include\shlwapi.h(1042) : error C2143: error de sintaxis : falta ';' delante de '__stdcall'
C:\Archivos de programa\Microsoft SDKs\Windows\v6.0A\include\shlwapi.h(1042) : error C4430: falta el especificador de tipo; se presupone int. Nota: C++ no admite default-int
C:\Archivos de programa\Microsoft SDKs\Windows\v6.0A\include\shlwapi.h(1042) : error C4430: falta el especificador de tipo; se presupone int. Nota: C++ no admite default-int
C:\Archivos de programa\Microsoft SDKs\Windows\v6.0A\include\shlwapi.h(1048) : error C2143: error de sintaxis : falta ';' delante de '__stdcall'
C:\Archivos de programa\Microsoft SDKs\Windows\v6.0A\include\shlwapi.h(1048) : error C4430: falta el especificador de tipo; se presupone int. Nota: C++ no admite default-int
C:\Archivos de programa\Microsoft SDKs\Windows\v6.0A\include\shlwapi.h(1048) : error C4430: falta el especificador de tipo; se presupone int. Nota: C++ no admite default-int
C:\Archivos de programa\Microsoft SDKs\Windows\v6.0A\include\shlwapi.h(1049) : error C2143: error de sintaxis : falta ';' delante de '__stdcall'
C:\Archivos de programa\Microsoft SDKs\Windows\v6.0A\include\shlwapi.h(1049) : error C4430: falta el especificador de tipo; se presupone int. Nota: C++ no admite default-int
C:\Archivos de programa\Microsoft SDKs\Windows\v6.0A\include\shlwapi.h(1049) : error C4430: falta el especificador de tipo; se presupone int. Nota: C++ no admite default-int
C:\Archivos de programa\Microsoft SDKs\Windows\v6.0A\include\shlwapi.h(1061) : error C2143: error de sintaxis : falta ';' delante de '__stdcall'
C:\Archivos de programa\Microsoft SDKs\Windows\v6.0A\include\shlwapi.h(1061) : error C4430: falta el especificador de tipo; se presupone int. Nota: C++ no admite default-int
C:\Archivos de programa\Microsoft SDKs\Windows\v6.0A\include\shlwapi.h(1061) : error C4430: falta el especificador de tipo; se presupone int. Nota: C++ no admite default-int
C:\Archivos de programa\Microsoft SDKs\Windows\v6.0A\include\shlwapi.h(1062) : error C2143: error de sintaxis : falta ';' delante de '__stdcall'
C:\Archivos de programa\Microsoft SDKs\Windows\v6.0A\include\shlwapi.h(1062) : error C4430: falta el especificador de tipo; se presupone int. Nota: C++ no admite default-int
C:\Archivos de programa\Microsoft SDKs\Windows\v6.0A\include\shlwapi.h(1062) : error C4430: falta el especificador de tipo; se presupone int. Nota: C++ no admite default-int
C:\Archivos de programa\Microsoft SDKs\Windows\v6.0A\include\shlwapi.h(1068) : error C2143: error de sintaxis : falta ';' delante de '__stdcall'
C:\Archivos de programa\Microsoft SDKs\Windows\v6.0A\include\shlwapi.h(1068) : error C4430: falta el especificador de tipo; se presupone int. Nota: C++ no admite default-int
C:\Archivos de programa\Microsoft SDKs\Windows\v6.0A\include\shlwapi.h(1074) : error C4430: falta el especificador de tipo; se presupone int. Nota: C++ no admite default-int
C:\Archivos de programa\Microsoft SDKs\Windows\v6.0A\include\shlwapi.h(1075) : error C2143: error de sintaxis : falta ';' delante de '__stdcall'
C:\Archivos de programa\Microsoft SDKs\Windows\v6.0A\include\shlwapi.h(1075) : error C4430: falta el especificador de tipo; se presupone int. Nota: C++ no admite default-int
C:\Archivos de programa\Microsoft SDKs\Windows\v6.0A\include\shlwapi.h(1081) : error C4430: falta el especificador de tipo; se presupone int. Nota: C++ no admite default-int
C:\Archivos de programa\Microsoft SDKs\Windows\v6.0A\include\shlwapi.h(1087) : error C2143: error de sintaxis : falta ';' delante de '__stdcall'
C:\Archivos de programa\Microsoft SDKs\Windows\v6.0A\include\shlwapi.h(1087) : error C4430: falta el especificador de tipo; se presupone int. Nota: C++ no admite default-int
C:\Archivos de programa\Microsoft SDKs\Windows\v6.0A\include\shlwapi.h(1088) : error C4430: falta el especificador de tipo; se presupone int. Nota: C++ no admite default-int
C:\Archivos de programa\Microsoft SDKs\Windows\v6.0A\include\shlwapi.h(1089) : error C2143: error de sintaxis : falta ';' delante de '__stdcall'
C:\Archivos de programa\Microsoft SDKs\Windows\v6.0A\include\shlwapi.h(1089) : error C4430: falta el especificador de tipo; se presupone int. Nota: C++ no admite default-int
C:\Archivos de programa\Microsoft SDKs\Windows\v6.0A\include\shlwapi.h(1090) : error C4430: falta el especificador de tipo; se presupone int. Nota: C++ no admite default-int
C:\Archivos de programa\Microsoft SDKs\Windows\v6.0A\include\shlwapi.h(1341) : error C2143: error de sintaxis : falta ';' delante de '__stdcall'
C:\Archivos de programa\Microsoft SDKs\Windows\v6.0A\include\shlwapi.h(1341) : error C4430: falta el especificador de tipo; se presupone int. Nota: C++ no admite default-int
C:\Archivos de programa\Microsoft SDKs\Windows\v6.0A\include\shlwapi.h(1347) : error C4430: falta el especificador de tipo; se presupone int. Nota: C++ no admite default-int
C:\Archivos de programa\Microsoft SDKs\Windows\v6.0A\include\shlwapi.h(1355) : error C2143: error de sintaxis : falta ';' delante de '__stdcall'
C:\Archivos de programa\Microsoft SDKs\Windows\v6.0A\include\shlwapi.h(1355) : error C4430: falta el especificador de tipo; se presupone int. Nota: C++ no admite default-int
C:\Archivos de programa\Microsoft SDKs\Windows\v6.0A\include\shlwapi.h(1361) : error C4430: falta el especificador de tipo; se presupone int. Nota: C++ no admite default-int
C:\Archivos de programa\Microsoft SDKs\Windows\v6.0A\include\shlwapi.h(1370) : error C2143: error de sintaxis : falta ';' delante de '__stdcall'
C:\Archivos de programa\Microsoft SDKs\Windows\v6.0A\include\shlwapi.h(1370) : error C4430: falta el especificador de tipo; se presupone int. Nota: C++ no admite default-int
C:\Archivos de programa\Microsoft SDKs\Windows\v6.0A\include\shlwapi.h(1370) : error C4430: falta el especificador de tipo; se presupone int. Nota: C++ no admite default-int
C:\Archivos de programa\Microsoft SDKs\Windows\v6.0A\include\shlwapi.h(1371) : error C2143: error de sintaxis : falta ';' delante de '__stdcall'
C:\Archivos de programa\Microsoft SDKs\Windows\v6.0A\include\shlwapi.h(1371) : error C4430: falta el especificador de tipo; se presupone int. Nota: C++ no admite default-int
C:\Archivos de programa\Microsoft SDKs\Windows\v6.0A\include\shlwapi.h(1371) : error C4430: falta el especificador de tipo; se presupone int. Nota: C++ no admite default-int
C:\Archivos de programa\Microsoft SDKs\Windows\v6.0A\include\shlwapi.h(1372) : error C2143: error de sintaxis : falta ';' delante de '__stdcall'
C:\Archivos de programa\Microsoft SDKs\Windows\v6.0A\include\shlwapi.h(1372) : error C4430: falta el especificador de tipo; se presupone int. Nota: C++ no admite default-int
C:\Archivos de programa\Microsoft SDKs\Windows\v6.0A\include\shlwapi.h(1374) : error C4430: falta el especificador de tipo; se presupone int. Nota: C++ no admite default-int
C:\Archivos de programa\Microsoft SDKs\Windows\v6.0A\include\shlwapi.h(1375) : error C2143: error de sintaxis : falta ';' delante de '__stdcall'
C:\Archivos de programa\Microsoft SDKs\Windows\v6.0A\include\shlwapi.h(1375) : error C4430: falta el especificador de tipo; se presupone int. Nota: C++ no admite default-int
C:\Archivos de programa\Microsoft SDKs\Windows\v6.0A\include\shlwapi.h(1377) : error C4430: falta el especificador de tipo; se presupone int. Nota: C++ no admite default-int
C:\Archivos de programa\Microsoft SDKs\Windows\v6.0A\include\shlwapi.h(1378) : error C2143: error de sintaxis : falta ';' delante de '__stdcall'
C:\Archivos de programa\Microsoft SDKs\Windows\v6.0A\include\shlwapi.h(1378) : error C4430: falta el especificador de tipo; se presupone int. Nota: C++ no admite default-int
C:\Archivos de programa\Microsoft SDKs\Windows\v6.0A\include\shlwapi.h(1378) : error C4430: falta el especificador de tipo; se presupone int. Nota: C++ no admite default-int
C:\Archivos de programa\Microsoft SDKs\Windows\v6.0A\include\shlwapi.h(1379) : error C2143: error de sintaxis : falta ';' delante de '__stdcall'
C:\Archivos de programa\Microsoft SDKs\Windows\v6.0A\include\shlwapi.h(1379) : error C4430: falta el especificador de tipo; se presupone int. Nota: C++ no admite default-int
C:\Archivos de programa\Microsoft SDKs\Windows\v6.0A\include\shlwapi.h(1379) : error C4430: falta el especificador de tipo; se presupone int. Nota: C++ no admite default-int
C:\Archivos de programa\Microsoft SDKs\Windows\v6.0A\include\shlwapi.h(1382) : error C2143: error de sintaxis : falta ';' delante de '__stdcall'
C:\Archivos de programa\Microsoft SDKs\Windows\v6.0A\include\shlwapi.h(1382) : error C4430: falta el especificador de tipo; se presupone int. Nota: C++ no admite default-int
C:\Archivos de programa\Microsoft SDKs\Windows\v6.0A\include\shlwapi.h(1382) : error C4430: falta el especificador de tipo; se presupone int. Nota: C++ no admite default-int
C:\Archivos de programa\Microsoft SDKs\Windows\v6.0A\include\shlwapi.h(1383) : error C2143: error de sintaxis : falta ';' delante de '__stdcall'
C:\Archivos de programa\Microsoft SDKs\Windows\v6.0A\include\shlwapi.h(1383) : error C4430: falta el especificador de tipo; se presupone int. Nota: C++ no admite default-int
C:\Archivos de programa\Microsoft SDKs\Windows\v6.0A\include\shlwapi.h(1383) : error C4430: falta el especificador de tipo; se presupone int. Nota: C++ no admite default-int
C:\Archivos de programa\Microsoft SDKs\Windows\v6.0A\include\shlwapi.h(1387) : error C2143: error de sintaxis : falta ';' delante de '__stdcall'
C:\Archivos de programa\Microsoft SDKs\Windows\v6.0A\include\shlwapi.h(1387) : error C4430: falta el especificador de tipo; se presupone int. Nota: C++ no admite default-int
C:\Archivos de programa\Microsoft SDKs\Windows\v6.0A\include\shlwapi.h(1387) : error C4430: falta el especificador de tipo; se presupone int. Nota: C++ no admite default-int
C:\Archivos de programa\Microsoft SDKs\Windows\v6.0A\include\shlwapi.h(1388) : error C2143: error de sintaxis : falta ';' delante de '__stdcall'
C:\Archivos de programa\Microsoft SDKs\Windows\v6.0A\include\shlwapi.h(1388) : error C4430: falta el especificador de tipo; se presupone int. Nota: C++ no admite default-int
C:\Archivos de programa\Microsoft SDKs\Windows\v6.0A\include\shlwapi.h(1388) : error C4430: falta el especificador de tipo; se presupone int. Nota: C++ no admite default-int
C:\Archivos de programa\Microsoft SDKs\Windows\v6.0A\include\shlwapi.h(1389) : error C2143: error de sintaxis : falta ';' delante de '__stdcall'
C:\Archivos de programa\Microsoft SDKs\Windows\v6.0A\include\shlwapi.h(1389) : error C4430: falta el especificador de tipo; se presupone int. Nota: C++ no admite default-int
C:\Archivos de programa\Microsoft SDKs\Windows\v6.0A\include\shlwapi.h(1389) : error C4430: falta el especificador de tipo; se presupone int. Nota: C++ no admite default-int
C:\Archivos de programa\Microsoft SDKs\Windows\v6.0A\include\shlwapi.h(1390) : error C2143: error de sintaxis : falta ';' delante de '__stdcall'
C:\Archivos de programa\Microsoft SDKs\Windows\v6.0A\include\shlwapi.h(1390) : error C4430: falta el especificador de tipo; se presupone int. Nota: C++ no admite default-int
C:\Archivos de programa\Microsoft SDKs\Windows\v6.0A\include\shlwapi.h(1390) : error C4430: falta el especificador de tipo; se presupone int. Nota: C++ no admite default-int
C:\Archivos de programa\Microsoft SDKs\Windows\v6.0A\include\shlwapi.h(1443) : error C2143: error de sintaxis : falta ';' delante de '__stdcall'
C:\Archivos de programa\Microsoft SDKs\Windows\v6.0A\include\shlwapi.h(1443) : error C4430: falta el especificador de tipo; se presupone int. Nota: C++ no admite default-int
C:\Archivos de programa\Microsoft SDKs\Windows\v6.0A\include\shlwapi.h(1443) : error C4430: falta el especificador de tipo; se presupone int. Nota: C++ no admite default-int
C:\Archivos de programa\Microsoft SDKs\Windows\v6.0A\include\shlwapi.h(1444) : error C2143: error de sintaxis : falta ';' delante de '__stdcall'
C:\Archivos de programa\Microsoft SDKs\Windows\v6.0A\include\shlwapi.h(1444) : error C4430: falta el especificador de tipo; se presupone int. Nota: C++ no admite default-int
C:\Archivos de programa\Microsoft SDKs\Windows\v6.0A\include\shlwapi.h(1444) : error C4430: falta el especificador de tipo; se presupone int. Nota: C++ no admite default-int
C:\Archivos de programa\Microsoft SDKs\Windows\v6.0A\include\shlwapi.h(1445) : error C2143: error de sintaxis : falta ';' delante de '__stdcall'
C:\Archivos de programa\Microsoft SDKs\Windows\v6.0A\include\shlwapi.h(1445) : error C4430: falta el especificador de tipo; se presupone int. Nota: C++ no admite default-int
C:\Archivos de programa\Microsoft SDKs\Windows\v6.0A\include\shlwapi.h(1445) : error C4430: falta el especificador de tipo; se presupone int. Nota: C++ no admite default-int
C:\Archivos de programa\Microsoft SDKs\Windows\v6.0A\include\shlwapi.h(1446) : error C2143: error de sintaxis : falta ';' delante de '__stdcall'
C:\Archivos de programa\Microsoft SDKs\Windows\v6.0A\include\shlwapi.h(1446) : error C4430: falta el especificador de tipo; se presupone int. Nota: C++ no admite default-int
C:\Archivos de programa\Microsoft SDKs\Windows\v6.0A\include\shlwapi.h(1446) : error C4430: falta el especificador de tipo; se presupone int. Nota: C++ no admite default-int
C:\Archivos de programa\Microsoft SDKs\Windows\v6.0A\include\shlwapi.h(1447) : error C2143: error de sintaxis : falta ';' delante de '__stdcall'
C:\Archivos de programa\Microsoft SDKs\Windows\v6.0A\include\shlwapi.h(1447) : error C4430: falta el especificador de tipo; se presupone int. Nota: C++ no admite default-int
C:\Archivos de programa\Microsoft SDKs\Windows\v6.0A\include\shlwapi.h(1455) : error C4430: falta el especificador de tipo; se presupone int. Nota: C++ no admite default-int
C:\Archivos de programa\Microsoft SDKs\Windows\v6.0A\include\shlwapi.h(1456) : error C2143: error de sintaxis : falta ';' delante de '__stdcall'
C:\Archivos de programa\Microsoft SDKs\Windows\v6.0A\include\shlwapi.h(1456) : error C4430: falta el especificador de tipo; se presupone int. Nota: C++ no admite default-int
C:\Archivos de programa\Microsoft SDKs\Windows\v6.0A\include\shlwapi.h(1464) : error C4430: falta el especificador de tipo; se presupone int. Nota: C++ no admite default-int
C:\Archivos de programa\Microsoft SDKs\Windows\v6.0A\include\shlwapi.h(1465) : error C2143: error de sintaxis : falta ';' delante de '__stdcall'
C:\Archivos de programa\Microsoft SDKs\Windows\v6.0A\include\shlwapi.h(1465) : error C4430: falta el especificador de tipo; se presupone int. Nota: C++ no admite default-int
C:\Archivos de programa\Microsoft SDKs\Windows\v6.0A\include\shlwapi.h(1465) : error C4430: falta el especificador de tipo; se presupone int. Nota: C++ no admite default-int
C:\Archivos de programa\Microsoft SDKs\Windows\v6.0A\include\shlwapi.h(1466) : error C2143: error de sintaxis : falta ';' delante de '__stdcall'
C:\Archivos de programa\Microsoft SDKs\Windows\v6.0A\include\shlwapi.h(1466) : error C4430: falta el especificador de tipo; se presupone int. Nota: C++ no admite default-int
C:\Archivos de programa\Microsoft SDKs\Windows\v6.0A\include\shlwapi.h(1466) : error C4430: falta el especificador de tipo; se presupone int. Nota: C++ no admite default-int
C:\Archivos de programa\Microsoft SDKs\Windows\v6.0A\include\shlwapi.h(1467) : error C2143: error de sintaxis : falta ';' delante de '__stdcall'
C:\Archivos de programa\Microsoft SDKs\Windows\v6.0A\include\shlwapi.h(1467) : error C4430: falta el especificador de tipo; se presupone int. Nota: C++ no admite default-int
C:\Archivos de programa\Microsoft SDKs\Windows\v6.0A\include\shlwapi.h(1467) : error C4430: falta el especificador de tipo; se presupone int. Nota: C++ no admite default-int
C:\Archivos de programa\Microsoft SDKs\Windows\v6.0A\include\shlwapi.h(1468) : error C2143: error de sintaxis : falta ';' delante de '__stdcall'
C:\Archivos de programa\Microsoft SDKs\Windows\v6.0A\include\shlwapi.h(1468) : error C4430: falta el especificador de tipo; se presupone int. Nota: C++ no admite default-int
C:\Archivos de programa\Microsoft SDKs\Windows\v6.0A\include\shlwapi.h(1468) : error C4430: falta el especificador de tipo; se presupone int. Nota: C++ no admite default-int
C:\Archivos de programa\Microsoft SDKs\Windows\v6.0A\include\shlwapi.h(1469) : error C2143: error de sintaxis : falta ';' delante de '__stdcall'
C:\Archivos de programa\Microsoft SDKs\Windows\v6.0A\include\shlwapi.h(1469) : error C4430: falta el especificador de tipo; se presupone int. Nota: C++ no admite default-int
C:\Archivos de programa\Microsoft SDKs\Windows\v6.0A\include\shlwapi.h(1469) : error C4430: falta el especificador de tipo; se presupone int. Nota: C++ no admite default-int
C:\Archivos de programa\Microsoft SDKs\Windows\v6.0A\include\shlwapi.h(1470) : error C2143: error de sintaxis : falta ';' delante de '__stdcall'
C:\Archivos de programa\Microsoft SDKs\Windows\v6.0A\include\shlwapi.h(1470) : error C4430: falta el especificador de tipo; se presupone int. Nota: C++ no admite default-int
C:\Archivos de programa\Microsoft SDKs\Windows\v6.0A\include\shlwapi.h(1470) : error C4430: falta el especificador de tipo; se presupone int. Nota: C++ no admite default-int
C:\Archivos de programa\Microsoft SDKs\Windows\v6.0A\include\shlwapi.h(1471) : error C2143: error de sintaxis : falta ';' delante de '__stdcall'
C:\Archivos de programa\Microsoft SDKs\Windows\v6.0A\include\shlwapi.h(1471) : error C4430: falta el especificador de tipo; se presupone int. Nota: C++ no admite default-int
C:\Archivos de programa\Microsoft SDKs\Windows\v6.0A\include\shlwapi.h(1471) : error C4430: falta el especificador de tipo; se presupone int. Nota: C++ no admite default-int
C:\Archivos de programa\Microsoft SDKs\Windows\v6.0A\include\shlwapi.h(1472) : error C2143: error de sintaxis : falta ';' delante de '__stdcall'
C:\Archivos de programa\Microsoft SDKs\Windows\v6.0A\include\shlwapi.h(1472) : error C4430: falta el especificador de tipo; se presupone int. Nota: C++ no admite default-int
C:\Archivos de programa\Microsoft SDKs\Windows\v6.0A\include\shlwapi.h(1472) : error C4430: falta el especificador de tipo; se presupone int. Nota: C++ no admite default-int
C:\Archivos de programa\Microsoft SDKs\Windows\v6.0A\include\shlwapi.h(1473) : error C2143: error de sintaxis : falta ';' delante de '__stdcall'
C:\Archivos de programa\Microsoft SDKs\Windows\v6.0A\include\shlwapi.h(1473) : error C4430: falta el especificador de tipo; se presupone int. Nota: C++ no admite default-int
C:\Archivos de programa\Microsoft SDKs\Windows\v6.0A\include\shlwapi.h(1475) : error C4430: falta el especificador de tipo; se presupone int. Nota: C++ no admite default-int
C:\Archivos de programa\Microsoft SDKs\Windows\v6.0A\include\shlwapi.h(1476) : error C2143: error de sintaxis : falta ';' delante de '__stdcall'
C:\Archivos de programa\Microsoft SDKs\Windows\v6.0A\include\shlwapi.h(1476) : error C4430: falta el especificador de tipo; se presupone int. Nota: C++ no admite default-int
C:\Archivos de programa\Microsoft SDKs\Windows\v6.0A\include\shlwapi.h(1478) : error C4430: falta el especificador de tipo; se presupone int. Nota: C++ no admite default-int
C:\Archivos de programa\Microsoft SDKs\Windows\v6.0A\include\shlwapi.h(1479) : error C2143: error de sintaxis : falta ';' delante de '__stdcall'
C:\Archivos de programa\Microsoft SDKs\Windows\v6.0A\include\shlwapi.h(1479) : error C4430: falta el especificador de tipo; se presupone int. Nota: C++ no admite default-int
C:\Archivos de programa\Microsoft SDKs\Windows\v6.0A\include\shlwapi.h(1479) : error C4430: falta el especificador de tipo; se presupone int. Nota: C++ no admite default-int
C:\Archivos de programa\Microsoft SDKs\Windows\v6.0A\include\shlwapi.h(1480) : error C2143: error de sintaxis : falta ';' delante de '__stdcall'
C:\Archivos de programa\Microsoft SDKs\Windows\v6.0A\include\shlwapi.h(1480) : error C4430: falta el especificador de tipo; se presupone int. Nota: C++ no admite default-int
C:\Archivos de programa\Microsoft SDKs\Windows\v6.0A\include\shlwapi.h(1480) : error C4430: falta el especificador de tipo; se presupone int. Nota: C++ no admite default-int
C:\Archivos de programa\Microsoft SDKs\Windows\v6.0A\include\shlwapi.h(1481) : error C2143: error de sintaxis : falta ';' delante de '__stdcall'
C:\Archivos de programa\Microsoft SDKs\Windows\v6.0A\include\shlwapi.h(1481) : error C4430: falta el especificador de tipo; se presupone int. Nota: C++ no admite default-int
C:\Archivos de programa\Microsoft SDKs\Windows\v6.0A\include\shlwapi.h(1481) : error C4430: falta el especificador de tipo; se presupone int. Nota: C++ no admite default-int
C:\Archivos de programa\Microsoft SDKs\Windows\v6.0A\include\shlwapi.h(1485) : error C2143: error de sintaxis : falta ';' delante de '__stdcall'
C:\Archivos de programa\Microsoft SDKs\Windows\v6.0A\include\shlwapi.h(1485) : error C4430: falta el especificador de tipo; se presupone int. Nota: C++ no admite default-int
C:\Archivos de programa\Microsoft SDKs\Windows\v6.0A\include\shlwapi.h(1485) : warning C4273: 'LSTATUS' : vinculación de DLL incoherente
        C:\Archivos de programa\Microsoft SDKs\Windows\v6.0A\include\shlwapi.h(1041) : vea la definición anterior de 'LSTATUS'
C:\Archivos de programa\Microsoft SDKs\Windows\v6.0A\include\shlwapi.h(1493) : error C4430: falta el especificador de tipo; se presupone int. Nota: C++ no admite default-int
C:\Archivos de programa\Microsoft SDKs\Windows\v6.0A\include\shlwapi.h(1494) : error C2143: error de sintaxis : falta ';' delante de '__stdcall'
C:\Archivos de programa\Microsoft SDKs\Windows\v6.0A\include\shlwapi.h(1494) : error C4430: falta el especificador de tipo; se presupone int. Nota: C++ no admite default-int
C:\Archivos de programa\Microsoft SDKs\Windows\v6.0A\include\shlwapi.h(1502) : error C4430: falta el especificador de tipo; se presupone int. Nota: C++ no admite default-int
C:\Archivos de programa\Microsoft SDKs\Windows\v6.0A\include\shlwapi.h(1503) : error C2143: error de sintaxis : falta ';' delante de '__stdcall'
C:\Archivos de programa\Microsoft SDKs\Windows\v6.0A\include\shlwapi.h(1503) : error C4430: falta el especificador de tipo; se presupone int. Nota: C++ no admite default-int
C:\Archivos de programa\Microsoft SDKs\Windows\v6.0A\include\shlwapi.h(1503) : warning C4273: 'LSTATUS' : vinculación de DLL incoherente
        C:\Archivos de programa\Microsoft SDKs\Windows\v6.0A\include\shlwapi.h(1041) : vea la definición anterior de 'LSTATUS'
C:\Archivos de programa\Microsoft SDKs\Windows\v6.0A\include\shlwapi.h(1503) : error C4430: falta el especificador de tipo; se presupone int. Nota: C++ no admite default-int
C:\Archivos de programa\Microsoft SDKs\Windows\v6.0A\include\shlwapi.h(1504) : error C2143: error de sintaxis : falta ';' delante de '__stdcall'
C:\Archivos de programa\Microsoft SDKs\Windows\v6.0A\include\shlwapi.h(1504) : error C4430: falta el especificador de tipo; se presupone int. Nota: C++ no admite default-int
C:\Archivos de programa\Microsoft SDKs\Windows\v6.0A\include\shlwapi.h(1504) : warning C4273: 'LSTATUS' : vinculación de DLL incoherente
        C:\Archivos de programa\Microsoft SDKs\Windows\v6.0A\include\shlwapi.h(1041) : vea la definición anterior de 'LSTATUS'
C:\Archivos de programa\Microsoft SDKs\Windows\v6.0A\include\shlwapi.h(1504) : error C4430: falta el especificador de tipo; se presupone int. Nota: C++ no admite default-int
C:\Archivos de programa\Microsoft SDKs\Windows\v6.0A\include\shlwapi.h(1617) : error C2065: 'IQueryAssociations' : identificador no declarado
C:\Archivos de programa\Microsoft SDKs\Windows\v6.0A\include\shlwapi.h(1617) : error C2275: 'IUnknown' : uso no válido de este tipo como expresión
        C:\Archivos de programa\Microsoft SDKs\Windows\v6.0A\include\unknwn.h(110) : vea la declaración de 'IUnknown'
C:\Archivos de programa\Microsoft SDKs\Windows\v6.0A\include\shlwapi.h(1618) : error C2448: 'DECLARE_INTERFACE_IID_' : el inicializador de estilo de función parece ser una definición de función
C:\Archivos de programa\Microsoft SDKs\Windows\v6.0A\include\shlwapi.h(1681) : error C2061: error de sintaxis : identificador 'PERCEIVED'
C:\Archivos de programa\Microsoft SDKs\Windows\v6.0A\include\shlwapi.h(1847) : error C2061: error de sintaxis : identificador 'PIDLIST_RELATIVE'
C:\Archivos de programa\Microsoft SDKs\Windows\v6.0A\include\shlwapi.h(1848) : error C2061: error de sintaxis : identificador 'PCUIDLIST_RELATIVE'[/
code]
=Newstyle=
Reply
Did someone tried to open solution in MonoDevelop (visual studio for linux & macOS)? Mine doesn't open it
Reply
Zeydlitz,

I have followed your instructions in a linux amd64 machine.
I'm doing the manual way only because 64bit binary is not available.

1) Is codeblock necessary ? build.sh has been decomissioned?
2) I have installed codeblock and the wx source code, wx-config works from xterm
3) I manage to build bin2cpp
4) Build workspace doesn't work, complains about some cpu options not compatible with my cpu, therefore I have unchecked the pentium options from individual projects
5) focusing on x86emitter: compile error wx/setup.h: No such file or directory. Shall we follow this instructions in order to fix it?
Reply
(09-10-2009, 11:38 AM)Butz Wrote: zeydlitz, thanks for the info.
1 to 3 ain't too hard to accomplish, but i have quite some trouble compiling bin2cpp. could you perhaps be a little more specific about how to do that? thanks!

[edit] lol, forget it: remove the ";" at line 176 and it compiles ;-)
let's see about the rest of pcsx2 now...[/edit]

[edit2] ran rebuild.sh - no problem, it generates some header files.
but once i try to compile the whole project in codeblocks it throws an "error: the chosen cpu does not support the x86-64 command set". i suppose i do have to tell codeblocks that i want the x86-32 version to be compiled? i should have all necessary 32 bit libraries, so that should not be the problem. help will be appreciated.[/edit2]

Butz,
I am compiling under amd64, which architecture are u using ?
I have solved the cpu error message removing some Pentium specific option in the compile / build options. Right click on each project and click "Build Options ...". Untick the CPU specific options from each Build Target (Debug, Release, ...).
Reply
(10-11-2009, 11:20 PM)sboschi Wrote: 5) focusing on x86emitter: compile error wx/setup.h: No such file or directory. Shall we follow this instructions in order to fix it?

Are we sure that wx/setup.h is needed ? I think it is not or if it is, something is wrong in the code.
Reply
setup.h is needed - you just have to link the contents of 3rdparty/wxWidgets/include/wx to common/include/wx, then that problem will be gone.
nonetheless the compilations then aborts with a lot of errors... :-(
Reply
What about running PCSX2 from Wine directly ? Would it work ?
I'm trying now and having some troubles ...

"The GS plugin failed to open/initialize"
Reply
Would not really work.
Reply




Users browsing this thread: 1 Guest(s)